Ferric tris(acetylacetonate)

Gas phase ion energetics data

Data compiled as indicated in comments:
LL - Sharon G. Lias and Joel F. Liebman
LLK - Sharon G. Lias, Rhoda D. Levin, and Sherif A. Kafafi
RDSH - Henry M. Rosenstock, Keith Draxl, Bruce W. Steiner, and John T. Herron
B - John E. Bartmess

Electron affinity determinations

EA (eV) Method Reference Comment
1.865 ± 0.022IMRESharpe, Eyler, et al., 1990EA given is actually -ΔGea(350 K); B

Ionization energy determinations

IE (eV) Method Reference Comment
7.6 ± 0.2PEWestmore, Reimer, et al., 1981LLK
8.64 ± 0.11EISchildcrout, Pearson, et al., 1968RDSH
8.45 ± 0.05EIBancroft, Reichert, et al., 1968RDSH
8.6PEShcheka and Vovna, 1992Vertical value; LL
8.20PEAkopyan, Vovna, et al., 1990Vertical value; LL
7.89EIWestmore, Reimer, et al., 1981Vertical value; LLK
8.10 ± 0.07PEEvans, Hamnett, et al., 1972Vertical value; LLK

Appearance energy determinations

Ion AE (eV) Other Products MethodReferenceComment
C10H14O4Fe+>9.4 ± 0.1?EIBancroft, Reichert, et al., 1968RDSH

Condensed phase thermochemistry data

Data compiled by: Eugene S. Domalski and Elizabeth D. Hearing

Quantity Value Units Method Reference Comment
solid,1 bar526.5J/mol*KN/AZhilina, Karyakin, et al., 1987

Constant pressure heat capacity of solid

Cp,solid (J/mol*K) Temperature (K) Reference Comment
429.9298.15Zhilina, Karyakin, et al., 1987T = 13 to 310 K.

References

Sharpe, Eyler, et al., 1990
Sharpe, P.; Eyler, J.R.; Richardson, D.E., Free Energies of Electron Attachment to Tris(acetylacetonate) and Tris(hexafluoroacetylacetonate) Transition-Metal Complexes in the Gas Phase: Experimental Results and Ligand Field Analysis, Inorg. Chem., 1990, 29, 15, 2779, https://doi.org/10.1021/ic00340a014 . [all data]

Westmore, Reimer, et al., 1981
Westmore, J.B.; Reimer, M.L.J.; Reichert, C., Ionization energies of metal chelates. Acetylacetonates, trifluoroacetylacetonates, and hexafluoroacetylacetonates of trivalent metals of the first transition series, Can. J. Chem., 1981, 59, 1797. [all data]

Schildcrout, Pearson, et al., 1968
Schildcrout, S.M.; Pearson, R.G.; Stafford, F.E., Ionization potentials of tris(-diketonate)metal(III) complexes and Koopmans' theorem, J. Am. Chem. Soc., 1968, 90, 4006. [all data]

Bancroft, Reichert, et al., 1968
Bancroft, G.M.; Reichert, C.; Westmore, J.B., Mass spectral studies of metal chelates. II. Mass spectra and appearance potentials of acetylacetonates of trivalent metals of the first transition series, Inorg. Chem., 1968, 7, 870. [all data]

Shcheka and Vovna, 1992
Shcheka, O.L.; Vovna, V.I., Electronic structure of some copper(II) and iron(III) -diketonates, J. Electron Spectrosc. Relat. Phenom., 1992, 60, 211. [all data]

Akopyan, Vovna, et al., 1990
Akopyan, M.E.; Vovna, V.I.; Kleimenov, S.N.; Lopatin, S.N.; Ustinov, A.Yu., Photoelectron spectroscopy of aluminum, chromium, and iron tris-B-diketonates, Opt. Spectrosc., 1990, 69, 53. [all data]

Evans, Hamnett, et al., 1972
Evans, S.; Hamnett, A.; Orchard, A.F.; Lloyd, D.R., Study of the metal-oxygen bond in simple tris-chelate complexes by He(I) photoelectron spectroscopy, Faraday Discuss. Chem. Soc., 1972, 54, 227. [all data]