Dicarbonylacetylacetonato iridium

Reaction thermochemistry data

Data compiled by: José A. Martinho Simões

Individual Reactions

C9H15IrO2 (cr) + 2Carbon monoxide (g) = C7H7IrO4 (cr) + 2Ethylene (g)

By formula: C9H15IrO2 (cr) + 2CO (g) = C7H7IrO4 (cr) + 2C2H4 (g)

Quantity Value Units Method Reference Comment
Δr-17.7 ± 1.1kcal/molDSCJesse, Baks, et al., 1978

References

Jesse, Baks, et al., 1978
Jesse, A.C.; Baks, A.; Stufkens, D.J.; Vrieze, K., Inorg. Chim. Acta, 1978, 29, 177. [all data]