Peroxysulfuryl difluoride

Phase change data

Data compiled by: William E. Acree, Jr., James S. Chickos

Enthalpy of vaporization

ΔvapH (kJ/mol) Temperature (K) Reference Comment
25.7223.Gambaruto, Sicre, et al., 1975Based on data from 198. - 248. K.

References

Gambaruto, Sicre, et al., 1975
Gambaruto, M.; Sicre, J.E.; Schumacher, H.J., The photochemical preparation of peroxydisulfuryl difluoride, fluorine fluorosulfate and peroxysulfuryl difluoride, Journal of Fluorine Chemistry, 1975, 5, 2, 175-179, https://doi.org/10.1016/S0022-1139(00)81705-4 . [all data]