NbH2

Vibrational and/or electronic energy levels

Data compiled by: Marilyn E. Jacox

State:   X

Vib.
sym.
 No.   Approximate
 type of mode
 cm-1   Med.   Method   References

a1 1 Sym. stretch 1611 m Ar IR Van Zee, Li, et al., 1995
2 Bend 519 m s Ar IR Van Zee, Li, et al., 1995
b2 3 Asym. stretch 1569 s Ar IR Van Zee, Li, et al., 1995

Additional references: Jacox, 1998, page 128

References

Van Zee, Li, et al., 1995
Van Zee, R.J.; Li, S.; Weltner, W., Jr., V, Nb, and Ta hydride molecules in deuterium and rare-gas matrices: Infrared and electron spin resonance spectra, J. Chem. Phys., 1995, 102, 11, 4367, https://doi.org/10.1063/1.469485 . [all data]

Jacox, 1998
Jacox, M.E., Vibrational and electronic energy levels of polyatomic transient molecules: supplement A, J. Phys. Chem. Ref. Data, 1998, 27, 2, 115-393, https://doi.org/10.1063/1.556017 . [all data]