Yttrium difluoride

Vibrational and/or electronic energy levels

Data compiled by: Marilyn E. Jacox

State:   X

Vib.
sym.
 No.   Approximate
 type of mode
 cm-1   Med.   Method   References

b2 3 Asym. stretch 571.4 Ar IR Wang and Andrews, 2010

References

Wang and Andrews, 2010
Wang, X.; Andrews, L., Infrared Spectra of MF, J. Phys. Chem. A, 2010, 114, 6, 2293, https://doi.org/10.1021/jp910936d . [all data]