CAS Reg. No. 13981-20-9

Reaction thermochemistry data

Data compiled by: John E. Bartmess

Individual Reactions

(CAS Reg. No. 13981-20-9 • 4294967295Oxygen, atomic) + Oxygen, atomic = CAS Reg. No. 13981-20-9

By formula: (CAS Reg. No. 13981-20-9 • 4294967295O) + O = CAS Reg. No. 13981-20-9

Quantity Value Units Method Reference Comment
Δr125.2 ± 7.1kcal/molCIDTBell, Zemski, et al., 2001gas phase

References

Bell, Zemski, et al., 2001
Bell, R.C.; Zemski, K.A.; Justes, D.R.; Castleman, A.W., Formation, structure and bond dissociation thresholds of gas- phase vanadium oxide cluster ions, J. Chem. Phys., 2001, 114, 2, 798-811, https://doi.org/10.1063/1.1329643 . [all data]