bis(8-hydroxyquinolinato)cobalt(II)

Phase change data

Data compiled by: William E. Acree, Jr., James S. Chickos

Quantity Value Units Method Reference Comment
Δsub205.3 ± 4.0kJ/molMEda Silva, Matos, et al., 1994
Δsub200. ± 10.kJ/molN/ABurkinshaw and Mortimer, 1984

Enthalpy of sublimation

ΔsubH (kJ/mol) Temperature (K) Method Reference Comment
186. ± 9.551.MEBurkinshaw and Mortimer, 1984Based on data from 533. - 569. K.

References

da Silva, Matos, et al., 1994
da Silva, M.A.V. Ribeiro; Matos, M. Agostinha R.; Gonçalves, J.M.; Johnson, P.M.; Pilcher, G.; Burkinshaw, P.M.; Mortimer, C.T., Standard enthalpies of formation and sublimation of some crystalline bis(8-hydroxyquinolate) metal complexes, Thermochimica Acta, 1994, 247, 2, 245-263, https://doi.org/10.1016/0040-6031(94)80125-8 . [all data]

Burkinshaw and Mortimer, 1984
Burkinshaw, Philip M.; Mortimer, Colin T., Enthalpies of sublimation of transition metal complexes, J. Chem. Soc., Dalton Trans., 1984, 1, 75, https://doi.org/10.1039/dt9840000075 . [all data]