bis(quinolin-8-olato-N1,O8)zinc

Phase change data

Data compiled by: William E. Acree, Jr., James S. Chickos

Quantity Value Units Method Reference Comment
Δsub43.8 ± 1.5kcal/molMEda Silva, Matos, et al., 1994
Δsub43. ± 1.kcal/molN/ABurkinshaw and Mortimer, 1984

Enthalpy of sublimation

ΔsubH (kcal/mol) Temperature (K) Method Reference Comment
40. ± 1.493.MEBurkinshaw and Mortimer, 1984Based on data from 473. - 513. K.

References

da Silva, Matos, et al., 1994
da Silva, M.A.V. Ribeiro; Matos, M. Agostinha R.; Gonçalves, J.M.; Johnson, P.M.; Pilcher, G.; Burkinshaw, P.M.; Mortimer, C.T., Standard enthalpies of formation and sublimation of some crystalline bis(8-hydroxyquinolate) metal complexes, Thermochimica Acta, 1994, 247, 2, 245-263, https://doi.org/10.1016/0040-6031(94)80125-8 . [all data]

Burkinshaw and Mortimer, 1984
Burkinshaw, Philip M.; Mortimer, Colin T., Enthalpies of sublimation of transition metal complexes, J. Chem. Soc., Dalton Trans., 1984, 1, 75, https://doi.org/10.1039/dt9840000075 . [all data]