Silver monohydride

Reaction thermochemistry data

Data compiled by: John E. Bartmess

Individual Reactions

Ag- + Hydrogen cation = HAg

By formula: Ag- + H+ = HAg

Quantity Value Units Method Reference Comment
Δr1406. ± 7.9kJ/molD-EABilodeau, Scheer, et al., 1998gas phase

References

Bilodeau, Scheer, et al., 1998
Bilodeau, R.C.; Scheer, M.; Haugen, H.K., Infrared Laser Photodetachment of Transition Metal Negative Ions: Studies on Cr-, Mo-, Cu-, and Ag-, J. Phys. B: Atom. Mol. Opt. Phys., 1998, 31, 17, 3885-3891, https://doi.org/10.1088/0953-4075/31/17/013 . [all data]