CrH2

Gas phase ion energetics data

Data compiled by: John E. Bartmess

Electron affinity determinations

EA (eV) Method Reference Comment
>2.49994LPESMiller, Feigerle, et al., 1986

Vibrational and/or electronic energy levels

Data compiled by: Marilyn E. Jacox

State:   X

Vib.
sym.
 No.   Approximate
 type of mode
 cm-1   Med.   Method   References

a1 1 CrH s-stretch 1650.9 Ar IR Xiao, Hauge, et al., 1992
Wang and Andrews, 2003
1 CrH s-stretch 1640.0 Kr IR Xiao, Hauge, et al., 1992
b2 3 CrH a-stretch 1627.7 Ne IR Wang and Andrews, 2003
3 CrH a-stretch 1614.5 Ar IR Xiao, Hauge, et al., 1992
Wang and Andrews, 2003
3 CrH a-stretch 1606.4 Kr IR Xiao, Hauge, et al., 1992

Additional references: Jacox, 1994, page 15; Van Zee, DeVore, et al., 1979

References

Miller, Feigerle, et al., 1986
Miller, A.E.S.; Feigerle, C.S.; Lineberger, W.C., Laser photoelectron spectrocopy of MnH2-, FeH2-, CoH2-, and NiH2-: Determination of the electron affinities for the metal dihydrides, J. Chem. Phys., 1986, 84, 4127. [all data]