Mercury hydride

Gas phase thermochemistry data

Quantity Value Units Method Reference Comment
Δfgas238.49kJ/molReviewChase, 1998Data last reviewed in June, 1963
Quantity Value Units Method Reference Comment
gas,1 bar219.71J/mol*KReviewChase, 1998Data last reviewed in June, 1963

Gas Phase Heat Capacity (Shomate Equation)

Cp° = A + B*t + C*t2 + D*t3 + E/t2
H° − H°298.15= A*t + B*t2/2 + C*t3/3 + D*t4/4 − E/t + F − H
S° = A*ln(t) + B*t + C*t2/2 + D*t3/3 − E/(2*t2) + G
    Cp = heat capacity (J/mol*K)
    H° = standard enthalpy (kJ/mol)
    S° = standard entropy (J/mol*K)
    t = temperature (K) / 1000.

View plot Requires a JavaScript / HTML 5 canvas capable browser.

View table.

Temperature (K) 298. - 1200.1200. - 6000.
A 19.6054336.96539
B 36.735692.207609
C -26.73107-0.046724
D 7.4701140.003146
E 0.147617-1.958155
F 231.7267222.5014
G 234.4304257.0566
H 238.4884238.4884
ReferenceChase, 1998Chase, 1998
Comment Data last reviewed in June, 1963 Data last reviewed in June, 1963

Constants of diatomic molecules

Data compiled by: Klaus P. Huber and Gerhard H. Herzberg

Data collected through January, 1976

Symbols used in the table of constants
SymbolMeaning
State electronic state and / or symmetry symbol
Te minimum electronic energy (cm-1)
ωe vibrational constant – first term (cm-1)
ωexe vibrational constant – second term (cm-1)
ωeye vibrational constant – third term (cm-1)
Be rotational constant in equilibrium position (cm-1)
αe rotational constant – first term (cm-1)
γe rotation-vibration interaction constant (cm-1)
De centrifugal distortion constant (cm-1)
βe rotational constant – first term, centrifugal force (cm-1)
re internuclear distance (Å)
Trans. observed transition(s) corresponding to electronic state
ν00 position of 0-0 band (units noted in table)
Diatomic constants for (202)HgH
StateTeωeωexeωeyeBeαeγeDeβereTrans.ν00
D 2Σ+ 1     [(4.7)]     [(1.89)] D → X R (37040)
Rydberg, 1932; Phillips and Davis, 1968
C 2Σ+     [4.519] 2   [34.8E-4] 3  [1.9287] C → X R 35587.4 Z
Rydberg, 1932; Phillips and Davis, 1968; Veseth, 1972
B 2Σ+     [4,028] 4   [16.27E-4] 5  [2.0429] B → X 6 R 33876.47 Z
Hulthen, 1928; Rydberg, 1932; Phillips and Davis, 1968; Veseth, 1972
A2 2Π3/2 28274 2068.24 7 Z 43.04 8  6.7411 7 9 0.2295 10  [2.818E-4] 7 11  1.5791 A2 → X 12 V 28616.23 13 Z
Rydberg, 1932; Fujioka and Tanaka, 1938; Porter, 1962; Porter and Davis, 1962; Phillips and Davis, 1968
StateTeωeωexeωeyeBeαeγeDeβereTrans.ν00
A1 2Π1/2  [1939.18] 7 Z 14  [6.5609] 7 15 16 17  [2.850E-4] 7 18  [1.6007] A1 → X 12 VR 24933.10 13 Z
Rydberg, 1932; Fujioka and Tanaka, 1938; missing citation; Porter and Davis, 1962; Porter and Davis, 1963; Phillips and Davis, 1968; missing citation; Stwalley, 1975
X 2Σ+ 0 [1203.24] 7 Z 19  [5.3888] 7 16 20 21 22  [3.953E-4] 7 23  [1.76620] 24
Kosman and Hinze, 1975; Stwalley, 1975

References

Chase, 1998
Chase, M.W., Jr., NIST-JANAF Themochemical Tables, Fourth Edition, J. Phys. Chem. Ref. Data, Monograph 9, 1998, 1-1951. [all data]

Rydberg, 1932
Rydberg, R., Uber das bandenspektrum des quecksilberhydrids, Z. Phys., 1932, 73, 74. [all data]

Phillips and Davis, 1968
Phillips, J.G.; Davis, S.P., Berkely analyses of molecular spectra, Pub. University of California Press, Berkeley and Los Angeles, 1968, 0. [all data]

Veseth, 1972
Veseth, L., Fine structure and perturbations in the electronic spectra of HgH and HgD, J. Mol. Spectrosc., 1972, 44, 251. [all data]

Hulthen, 1928
Hulthen, E., Neuere unterschungen uber das bandenspektrum des quecksilberhydrids, Z. Phys., 1928, 50, 319. [all data]

Fujioka and Tanaka, 1938
Fujioka, Y.; Tanaka, Y., On the molecular spectra 2Π→2Σ of mercury hydride and deuteride. I. 2Σ state, Sci. Pap. Inst. Phys. Chem. Res. Jpn., 1938, 34, 713. [all data]

Porter, 1962
Porter, T.L., Band-spectrum analysis of mercury hydride, J. Opt. Soc. Am., 1962, 52, 11, 1201-1205. [all data]

Porter and Davis, 1962
Porter, T.L.; Davis, S.P., Isotope shift in the spectrum of mercury hydride, J. Opt. Soc. Am., 1962, 52, 1206. [all data]

Porter and Davis, 1963
Porter, T.L.; Davis, S.P., Hyperfine structure in the spectrum of mercury hydride, J. Opt. Soc. Am., 1963, 53, 338. [all data]

Stwalley, 1975
Stwalley, W.C., Mass-reduced quantum numbers: application to the isotopic mercury hydrides, J. Chem. Phys., 1975, 63, 3062. [all data]

Kosman and Hinze, 1975
Kosman, W.M.; Hinze, J., Inverse perturbation analysis: improving the accuracy of potential energy curves, J. Mol. Spectrosc., 1975, 56, 93. [all data]

Veseth, 1973
Veseth, L., Hund's coupling case (c) in diatomic molecules. II. Examples, J. Phys. B:, 1973, 6, 1484. [all data]

Eakin and Davis, 1970
Eakin, D.M.; Davis, S.P., Band spectra and hyperfine structure of HgH, HgD, and HgT, J. Mol. Spectrosc., 1970, 35, 27. [all data]

Rydberg, 1933
Rydberg, R., Uber einige potentialkurven des quecksilberhydrids, Z. Phys., 1933, 80, 514. [all data]

Knight and Weltner, 1971
Knight, L.B., Jr.; Weltner, W., Jr., Hyperfine interaction, chemical bonding, and isotope effect in ZnH, CdH, and HgH molecules, J. Chem. Phys., 1971, 55, 2061. [all data]