Acenaphthylene, 2a,3,4,5,5a,6,7,8,8a,8b-decahydro-, (2aα,5aα,8aα,8bα)-

Reaction thermochemistry data

Data compiled by: Hussein Y. Afeefy, Joel F. Liebman, and Stephen E. Stein

Individual Reactions

C12H20 = C12H18

By formula: C12H20 = C12H18

Quantity Value Units Method Reference Comment
Δr0.0kcal/molEqkFrye and Weitkamp, 1969gas phase; Equilibration

References

Frye and Weitkamp, 1969
Frye, C.G.; Weitkamp, A.W., Equilibrium hydrogenations of multi-ring aromatics, J. Chem. Eng. Data, 1969, 14, 372-376. [all data]