4,9-Epoxy-1H-benz[f]isoindole-1,3(2H)-dione, 3a,9a-dichloro-2-(3,4-dichloro-2,5-dihydro-2,5-dioxo-1H-pyrrol-1-yl)-3a,4,9,9a-tetrahydro-4,9-diphenyl-

Reaction thermochemistry data

Data compiled by: Hussein Y. Afeefy, Joel F. Liebman, and Stephen E. Stein

Individual Reactions

1,3 Diphenylisobenzofuran + 3,4,3',4'-Tetrachloro-bipyrrolyl-2,5,2',5'-tetraone = C28H14Cl4N2O5

By formula: C20H14O + C8Cl4N2O4 = C28H14Cl4N2O5

Quantity Value Units Method Reference Comment
Δr-73.2kJ/molCmAdigezalov, Kiselev, et al., 1991liquid phase; solvent: Dioxane

References

Adigezalov, Kiselev, et al., 1991
Adigezalov, N.R.; Kiselev, V.D.; Konovalov, A.I., Bis-reagents in Diels-Alder reactions. V. Kinetics and thermochemistry of reactions of N,N'-bis(dichloromaleimides) with 1,3-diphenylisobenzofuran, Zh. Org. Khim., 1991, 27, 1774-1779. [all data]