1,2,3-Propanetriol, tripropanoate

Normal alkane RI, non-polar column, custom temperature program

Data compiled by: NIST Mass Spectrometry Data Center, William E. Wallace, director

Column type Capillary
Active phase SF-96
Column length (m) 40.
Carrier gas
Substrate
Column diameter (mm) 0.28
Phase thickness (μm)
Program 75C => 3C/min => 190C(25min) => 3C/min => 210C
I 1546.
ReferenceKawasaki, Matsui, et al., 1998
Comment MSDC-RI

Condensed phase thermochemistry data

Data compiled by: Eugene S. Domalski and Elizabeth D. Hearing

Constant pressure heat capacity of liquid

Cp,liquid (J/mol*K) Temperature (K) Reference
481.3298.15Nilsson and Wadso, 1986

Phase change data

Data compiled as indicated in comments:
ALS - Hussein Y. Afeefy, Joel F. Liebman, and Stephen E. Stein
AC - William E. Acree, Jr., James S. Chickos

Quantity Value Units Method Reference Comment
Δvap21.84 ± 0.096kcal/molCNilsson and Wadso, 1986ALS
Δvap21.8 ± 0.1kcal/molCNilsson and Wadso, 1986AC

Normal alkane RI, non-polar column, isothermal

View large format table.

Column type Active phase Temperature (C) I Reference Comment
CapillaryOV-101130.1571.Leol'ko, Krasnykh, et al., 2007He; Column length: 30. m; Column diameter: 0.25 mm
CapillaryOV-101140.1569.Leol'ko, Krasnykh, et al., 2007He; Column length: 30. m; Column diameter: 0.25 mm
CapillaryOV-101150.1567.Leol'ko, Krasnykh, et al., 2007He; Column length: 30. m; Column diameter: 0.25 mm
CapillaryOV-101160.1565.Leol'ko, Krasnykh, et al., 2007He; Column length: 30. m; Column diameter: 0.25 mm

References

Kawasaki, Matsui, et al., 1998
Kawasaki, W.; Matsui, K.; Akakabe, Y.; Itai, N.; Kajiwara, T., Long-chain aldehyde-forming activity in tobacco leaves, Phytochemistry, 1998, 49, 6, 1565-1568, https://doi.org/10.1016/S0031-9422(98)00236-2 . [all data]