Neodymium difluoride

Gas phase ion energetics data

Data compiled as indicated in comments:
RDSH - Henry M. Rosenstock, Keith Draxl, Bruce W. Steiner, and John T. Herron

Ionization energy determinations

IE (eV) Method Reference Comment
5.6 ± 0.3EIZmbov and Margrave, 1966RDSH

Appearance energy determinations

Ion AE (eV) Other Products MethodReferenceComment
NdF+~12.5 ± 0.5FEIZmbov and Margrave, 1968RDSH

References

Zmbov and Margrave, 1966
Zmbov, K.F.; Margrave, J.L., Mass-spectrometric studies at high temperatures. XI.The sublimation pressure of NdF, and the stabilities of gaseous NdF2 and NdF, J. Chem. Phys., 1966, 45, 3167. [all data]

Zmbov and Margrave, 1968
Zmbov, K.F.; Margrave, J.L., Mass spectrometric studies of scandium, yttrium, lanthanum, and rare-earth fluorides, Advan. Chem. Ser., 1968, 72, 267. [all data]