bis(1,1,1-trifluoro-2,4-pentanedionato)berylium(II)

Phase change data

Data compiled by: William E. Acree, Jr., James S. Chickos

Quantity Value Units Method Reference Comment
Δsub21.0 ± 1.6kcal/molN/AGrinberg, Lazarev, et al., 1987

Enthalpy of vaporization

ΔvapH (kcal/mol) Temperature (K) Method Reference Comment
14.3 ± 0.1431.BGLazarev, Greenberg, et al., 1988Based on data from 387. - 474. K.

Enthalpy of sublimation

ΔsubH (kcal/mol) Temperature (K) Method Reference Comment
20.4 ± 1.5368.BGGrinberg, Lazarev, et al., 1987Based on data from 354. - 383. K. See also Lazarev, Greenberg, et al., 1988.

References

Grinberg, Lazarev, et al., 1987
Grinberg, Ya.Kh.; Lazarev, V.B.; Petukhov, V.V.; Novikova, G.Ya.; Sharpataya, G.A.; Ozerova, Z.P., Dokl. Akad. Nauk SSSR, 1987, 297, 633. [all data]

Lazarev, Greenberg, et al., 1988
Lazarev, V.B.; Greenberg, J.H.; Ozerova, Z.P.; Sharpataya, G.A., DSC and vapour pressure investigation of some β-diketonates, Journal of Thermal Analysis, 1988, 33, 3, 797-799, https://doi.org/10.1007/BF02138589 . [all data]