CAS Reg. No. 13937-34-3

Reaction thermochemistry data

Data compiled by: John E. Bartmess

Individual Reactions

(CAS Reg. No. 13937-34-3 • 4294967295Phosphinidene) + Phosphinidene = CAS Reg. No. 13937-34-3

By formula: (CAS Reg. No. 13937-34-3 • 4294967295HP) + HP = CAS Reg. No. 13937-34-3

Quantity Value Units Method Reference Comment
Δr91.7 ± 8.1kcal/molN/AErvin and Lineberger, 2005gas phase; High level calcns( Curtiss, Raghavachari, et al., 1991, Ricca and Bauschlicher, 1998) give DH ca. 84
Δr84.7 ± 2.9kcal/molTherBartmess, Scott, et al., 1979gas phase; The D-EA cycle does not close by 7 kcal/mol. The reason for this discrepancy is not known; value altered from reference due to change in acidity scale

References

Ervin and Lineberger, 2005
Ervin, K.M.; Lineberger, W.C., Photoelectron spectroscopy of phosphorus hydride anions, J. Chem. Phys., 2005, 122, 19, 194303, https://doi.org/10.1063/1.1881153 . [all data]

Curtiss, Raghavachari, et al., 1991
Curtiss, L.A.; Raghavachari, K.; Trucks, G.W.; Pople, J.A., Gaussian-2 Theory for Molecular Energies of First- and Second-row Compounds, J. Chem. Phys., 1991, 94, 11, 7221, https://doi.org/10.1063/1.460205 . [all data]

Ricca and Bauschlicher, 1998
Ricca, A.; Bauschlicher, C.W., Jr., Accurate Heats of Formation for PHn, PHn+, and PHn-, Chem. Phys. Lett., 1998, 285, 5-6, 455, https://doi.org/10.1016/S0009-2614(97)01468-1 . [all data]

Bartmess, Scott, et al., 1979
Bartmess, J.E.; Scott, J.A.; McIver, R.T., Jr., The gas phase acidity scale from methanol to phenol, J. Am. Chem. Soc., 1979, 101, 6047. [all data]