Lead chloride

Gas phase thermochemistry data

Quantity Value Units Method Reference Comment
Δfgas15.06kJ/molReviewChase, 1998Data last reviewed in June, 1973
Quantity Value Units Method Reference Comment
gas,1 bar259.65J/mol*KReviewChase, 1998Data last reviewed in June, 1973

Gas Phase Heat Capacity (Shomate Equation)

Cp° = A + B*t + C*t2 + D*t3 + E/t2
H° − H°298.15= A*t + B*t2/2 + C*t3/3 + D*t4/4 − E/t + F − H
S° = A*ln(t) + B*t + C*t2/2 + D*t3/3 − E/(2*t2) + G
    Cp = heat capacity (J/mol*K)
    H° = standard enthalpy (kJ/mol)
    S° = standard entropy (J/mol*K)
    t = temperature (K) / 1000.

View plot Requires a JavaScript / HTML 5 canvas capable browser.

View table.

Temperature (K) 298. - 6000.
A 37.16827
B 0.125401
C 0.614236
D -0.071197
E -0.083843
F 3.692589
G 304.0977
H 15.06202
ReferenceChase, 1998
Comment Data last reviewed in June, 1973

References

Chase, 1998
Chase, M.W., Jr., NIST-JANAF Themochemical Tables, Fourth Edition, J. Phys. Chem. Ref. Data, Monograph 9, 1998, 1-1951. [all data]