3-Hexenoic acid, methyl ester, (E)-

Van Den Dool and Kratz RI, polar column, temperature ramp

View large format table.

Column type Active phase I Reference Comment
CapillaryDB-Wax1259.Umano, Hagi, et al., 1992He, 40. C @ 10. min, 2. K/min; Column length: 30. m; Column diameter: 0.25 mm; Tend: 200. C
CapillaryCarbowax 20M1276.Suárez and Duque, 19912. K/min; Column length: 25. m; Column diameter: 0.31 mm; Tstart: 50. C; Tend: 200. C
CapillaryCarbowax 20M1286.Suárez and Duque, 19912. K/min; Column length: 25. m; Column diameter: 0.31 mm; Tstart: 50. C; Tend: 200. C

Normal alkane RI, non-polar column, temperature ramp

View large format table.

Column type Active phase I Reference Comment
CapillaryUltra-1920.Iwaoka, Zhang, et al., 199350. m/0.31 mm/0.17 μm, He, 30. C @ 4. min, 2. K/min; Tend: 210. C
CapillaryDB-1920.Takeoka and Butter, 1989He, 30. C @ 4. min, 2. K/min; Column length: 60. m; Column diameter: 0.32 mm; Tend: 210. C
CapillaryDB-1921.Takeoka and Butter, 1989He, 30. C @ 4. min, 2. K/min; Column length: 60. m; Column diameter: 0.32 mm; Tend: 210. C

Normal alkane RI, non-polar column, custom temperature program

View large format table.

Column type Active phase I Reference Comment
CapillaryDB-1910.Takeoka, Flath, et al., 198830. m/0.25 mm/0.25 μm, H2; Program: 30C (2min) => 2C/min => 150C => 4C/min => 250C
CapillaryDB-1913.Takeoka, Flath, et al., 198830. m/0.25 mm/0.25 μm, H2; Program: 30C (2min) => 2C/min => 150C => 4C/min => 250C

Normal alkane RI, polar column, temperature ramp

View large format table.

Column type Active phase I Reference Comment
CapillaryDB-Wax1258.Takeoka and Butter, 198960. m/0.32 mm/0.25 μm, He, 30. C @ 4. min, 2. K/min; Tend: 180. C
CapillaryDB-Wax1259.Takeoka and Butter, 198960. m/0.32 mm/0.25 μm, He, 30. C @ 4. min, 2. K/min; Tend: 180. C

References

Umano, Hagi, et al., 1992
Umano, K.; Hagi, Y.; Nakahara, K.; Shoji, A.; Shibamoto, T., Volatile constituents of green and ripened pineapple (Aanas comosus [L.] Merr.), J. Agric. Food Chem., 1992, 40, 4, 599-603, https://doi.org/10.1021/jf00016a014 . [all data]

Suárez and Duque, 1991
Suárez, M.; Duque, C., Volatile constituents of lulo (Salanum vestissimum D.) fruit, J. Agric. Food Chem., 1991, 39, 8, 1498-1500, https://doi.org/10.1021/jf00008a026 . [all data]

Iwaoka, Zhang, et al., 1993
Iwaoka, W.T.; Zhang, X.; Hamilton, R.A.; Chia, C.L.; Tang, C.S., Identifying volatiles in soursop and comparing their changing profiles during ripening, HortScience, 1993, 28, 8, 817-819. [all data]

Takeoka and Butter, 1989
Takeoka, G.; Butter, R.G., Volatile constituents of pineapple (Ananas Comosus [L.] Merr.) in Flavor Chemistry. Trends and Developments, Teranishi,R.; Buttery,R.G.; Shahidi,F., ed(s)., American Chemical Society, Washington, DC, 1989, 223-237. [all data]

Takeoka, Flath, et al., 1988
Takeoka, G.R.; Flath, R.A.; Güntert, M.; Jennings, W., Nectarine volatiles: vacuum steam distillation versus headspace sampling, J. Agric. Food Chem., 1988, 36, 3, 553-560, https://doi.org/10.1021/jf00081a037 . [all data]