HGaCl2

Vibrational and/or electronic energy levels

Data compiled by: Marilyn E. Jacox

State:   X

Vib.
sym.
 No.   Approximate
 type of mode
 cm-1   Med.   Method   References

a1 1 GaH stretch 2015.3 s Ar IR Koppe, Tacke, et al., 1991
Muller and Sternkicker, 1999
2 GaCl2 s-stretch 414.3 w m Ar IR Koppe, Tacke, et al., 1991
Muller and Sternkicker, 1999
b1 4 OPLA 464.3 m s Ar IR Koppe, Tacke, et al., 1991
Muller and Sternkicker, 1999
b2 5 H deform. 607.5 vs Ar IR Koppe, Tacke, et al., 1991
Muller and Sternkicker, 1999
6 GaCl2 a-stretch 437.3 s Ar IR Koppe, Tacke, et al., 1991
Muller and Sternkicker, 1999

Additional references: Jacox, 1994, page 169; Jacox, 2003, page 194

References

Koppe, Tacke, et al., 1991
Koppe, R.; Tacke, M.; Schnockel, H., Infrarotspektroskopischer Nachweis von monomerem HGaCl2 in festem Argon, Z. Anorg. Allg. Chem., 1991, 605, 1, 35, https://doi.org/10.1002/zaac.19916050104 . [all data]

Muller and Sternkicker, 1999
Muller, J.; Sternkicker, H., J. Chem. Soc., 1999, Dalton Trans., 4149. [all data]

Jacox, 1994
Jacox, M.E., Vibrational and electronic energy levels of polyatomic transient molecules, American Chemical Society, Washington, DC, 1994, 464. [all data]

Jacox, 2003
Jacox, M.E., Vibrational and electronic energy levels of polyatomic transient molecules: supplement B, J. Phys. Chem. Ref. Data, 2003, 32, 1, 1-441, https://doi.org/10.1063/1.1497629 . [all data]