Bicyclo[7.2.0]undec-4-ene, 4,11,11-trimethyl-8-methylene-

Normal alkane RI, non-polar column, temperature ramp

Data compiled by: NIST Mass Spectrometry Data Center, William E. Wallace, director

Column type CapillaryCapillary
Active phase DB-1DB-1
Column length (m) 30.30.
Carrier gas HeliumHelium
Substrate
Column diameter (mm) 0.250.25
Phase thickness (μm) 0.250.25
Tstart (C) 50.50.
Tend (C) 220.220.
Heat rate (K/min) 4.4.
Initial hold (min) 2.2.
Final hold (min) 2.2.
I 1504.1476.
ReferenceXu, Tang, et al., 2010Xu, Tang, et al., 2010
Comment MSDC-RI MSDC-RI

References

Xu, Tang, et al., 2010
Xu, X.; Tang, Z.; Liang, Y., Comparative analysis of plant essential oils by GC-MS coupled with integrated chemometric resolution methods, Anal. Methods, 2010, 2, 4, 359-367, https://doi.org/10.1039/b9ay00213h . [all data]