β-Ocimene

Normal alkane RI, non-polar column, temperature ramp

Data compiled by: NIST Mass Spectrometry Data Center, William E. Wallace, director

Column type CapillaryCapillaryCapillaryCapillaryCapillary
Active phase DB-5HP-5HP-5HP-5 MSHP-1
Column length (m) 30.30.30.30.50.
Carrier gas HeliumNitrogenHeliumHeliumHe
Substrate
Column diameter (mm) 0.250.250.250.250.2
Phase thickness (μm) 0.250.250.250.250.5
Tstart (C) 100.50.50.60.60.
Tend (C) 260.280.240.200.250.
Heat rate (K/min) 10.5.3.4.2.
Initial hold (min) 1.1.5.
Final hold (min) 10.1. 20.120.
I 1037.1035.1037.1037.1032.
ReferenceBoukhris, Bouaziz, et al., 2012Tekaya-Karoui, Boughalleb, et al., 2011Monsef-Esfahani, Miri, et al., 2010Araque, Rojas, et al., 2007Castel, Fernandez, et al., 2006
Comment MSDC-RI MSDC-RI MSDC-RI MSDC-RI MSDC-RI
Column type CapillaryCapillaryCapillaryCapillaryCapillary
Active phase HP-5MSHP-1SPB-1SPB-1DB-1
Column length (m) 30.50.30.30.60.
Carrier gas HeN2HeHeHe
Substrate
Column diameter (mm) 0.250.20.250.250.32
Phase thickness (μm) 0.250.330.250.250.25
Tstart (C) 50.60.40.40.50.
Tend (C) 280.250.200.200.200.
Heat rate (K/min) 5.2.3.3.3.
Initial hold (min) 4. 10.10.6.
Final hold (min) 10.20.
I 1044.1032.1038.1040.1035.
ReferenceKim, El-Aty, et al., 2006Cavalli, Fernandez, et al., 2004Vichi, Castellote, et al., 2003Vichi, Pizzale, et al., 2003Cimanga, Apers, et al., 2002
Comment MSDC-RI MSDC-RI MSDC-RI MSDC-RI MSDC-RI
Column type CapillaryCapillaryCapillary
Active phase SPB-1DB-5SPB-5
Column length (m) 50.30.30.
Carrier gas  He
Substrate
Column diameter (mm) 0.20.25
Phase thickness (μm) 0.330.251.0
Tstart (C) 60.50.50.
Tend (C) 260.250.250.
Heat rate (K/min) 4.2.8.
Initial hold (min)  5.
Final hold (min)
I 1039.1046.1044.
ReferenceChoo, Wong, et al., 1999Reverchon, Porta, et al., 1997King and Knight, 1992
Comment MSDC-RI MSDC-RI MSDC-RI

Normal alkane RI, non-polar column, custom temperature program

Data compiled by: NIST Mass Spectrometry Data Center, William E. Wallace, director

Column type CapillaryCapillaryCapillaryCapillaryCapillary
Active phase HP-5MSDB-5HP-5HP-5DB-5
Column length (m) 30.30.30.30.30.
Carrier gas HeHe He
Substrate
Column diameter (mm) 0.250.250.250.250.32
Phase thickness (μm) 0.250.250.250.251.
Program 40C(3min) => 6C/min => 160C => 10C/min => 300C (10min)35C => 4C/min => 180C => 10C/min => 250C>2.5C/min => 180C => 100C/min => 250C (7.3min)50C(3min) => 3C/min => 150C(10min) => 10 C/min => 250C0C(5min) => 60C/min => 60C (5min) => 4C/min => 250C (5min)
I 1040.1031.1048.1037.1027.
ReferenceYu, Huang, et al., 2007Albuquerque, Canuto, et al., 2006Goodner, Mahattanatawee, et al., 2006Güllüce, Sökmen, et al., 2003Storer, Elmore, et al., 1993
Comment MSDC-RI MSDC-RI MSDC-RI MSDC-RI MSDC-RI

Kovats' RI, non-polar column, custom temperature program

Data compiled by: NIST Mass Spectrometry Data Center, William E. Wallace, director

Column type Capillary
Active phase SPB-1
Column length (m) 30.
Carrier gas
Substrate
Column diameter (mm) 0.25
Phase thickness (μm) 0.25
Program not specified
I 1038.
ReferenceRiu-Aumatell, Castellari, et al., 2004
Comment MSDC-RI

References

Boukhris, Bouaziz, et al., 2012
Boukhris, M.; Bouaziz, M.; Feki, I.; Jemai, H.; El Feki, A.; Sayadi, S., Hypoglycemic and antioxidant effects of leaf essential oil of Pelargonium graveolens L'Her. in alloxan induced diabetic rats, Lipids in Health and Disease, 2012, 11, 1, 1-10, https://doi.org/10.1186/1476-511X-11-81 . [all data]

Tekaya-Karoui, Boughalleb, et al., 2011
Tekaya-Karoui, A.; Boughalleb, N.; Hammami, S.; Ben Jannet, H.; Mighri, Z., Chemical composition and antifungal activity of volatile components from woody terminal branches and roots of Tetraclinis articulate (Vahl.) Masters growing in Tunisia, Afr. J. Plant Sci., 2011, 5, 2, 115-122. [all data]

Monsef-Esfahani, Miri, et al., 2010
Monsef-Esfahani, H.R.; Miri, A.; Amini, M.; Amanzadeh, Y.; Hadjiakhoondi, A.; Hajiaghaee, R.; Ajani, Y., Seasonal variations in the chemical composition, antioxidant activity and total phenolic content of Teucrium persicum Boiss. essential oils, Res. J. Biol. Sci., 2010, 5, 7, 492-498, https://doi.org/10.3923/rjbsci.2010.492.498 . [all data]

Araque, Rojas, et al., 2007
Araque, M.; Rojas, L.B.; Usubillaga, A., Antibacterial activity of essential oil of Foeniculum vulgare miller againts multiresistant gram-negative bacilli from nosocomial infections, Ciencia, 2007, 15, 3, 366-370. [all data]

Castel, Fernandez, et al., 2006
Castel, C.; Fernandez, X.; Lizzani-Cuvelier, L.; Perichet, C.; Lavoine, S., Characterization of the Chemical Composition of a Byproduct from Siam Benzoin Gum, J. Agric. Food Chem., 2006, 54, 23, 8848-8854, https://doi.org/10.1021/jf061193y . [all data]

Kim, El-Aty, et al., 2006
Kim, M.R.; El-Aty, A.M.A.; Choi, J.-H.; Lee, K.B.; Shim, J.H., Identification of volatile components in Angelica species using supercritical-CO2 fluid extraction and solid phase microextraction coupled to gas chromatography-mass spectrometry, Biomedical Chromatography, 2006, 20, 11, 1267-1273, https://doi.org/10.1002/bmc.696 . [all data]

Cavalli, Fernandez, et al., 2004
Cavalli, J.-F.; Fernandez, X.; Lizzani-Cievelier, L.; Loiseau, A.-M., Characterization of volatile compounds of French and Spanish virgin olive oil by HS-SPME: identification of quality-freshness markers, Food Chem., 2004, 88, 1, 151-157, https://doi.org/10.1016/j.foodchem.2004.04.003 . [all data]

Vichi, Castellote, et al., 2003
Vichi, S.; Castellote, A.I.; Pizzale, L.; Conte, L.S.; Buxaderas, S.; López-Tamames, E., Analysis of virgin olive oil volatile compounds by headspace solid-phase microextraction coupled to gas chromatography with mass spectrometric and flame ionization detection, J. Chromatogr. A, 2003, 983, 1-2, 19-33, https://doi.org/10.1016/S0021-9673(02)01691-6 . [all data]

Vichi, Pizzale, et al., 2003
Vichi, S.; Pizzale, L.; Conte, L.S.; Buxaderas, S.; López-Tamames, E., Solid-phase microextraction in the analysis of virgin olive oil volatile fraction: characterization of virgin olive oils from two distinct geographical areas of Northern Italy, J. Agric. Food Chem., 2003, 51, 22, 6572-6577, https://doi.org/10.1021/jf030269c . [all data]

Cimanga, Apers, et al., 2002
Cimanga, K.; Apers, S.; de Bruyne, T.; van Miert, S.; Hermans, N.; Totté, J.; Pieters, L.; Vlietinck, A.J., Chemical composition and antifungal activity of essential oils of some aromatic medicinal plants growing in the democratic republic of Congo, J. Essent. Oil Res., 2002, 14, 5, 382-387, https://doi.org/10.1080/10412905.2002.9699894 . [all data]

Choo, Wong, et al., 1999
Choo, L.-C.; Wong, S.-M.; Liew, K.-Y., Essential oil of nutmeg pericarp, J. Sci. Food Agric., 1999, 79, 13, 1954-1957, https://doi.org/10.1002/(SICI)1097-0010(199910)79:13<1954::AID-JSFA460>3.0.CO;2-I . [all data]

Reverchon, Porta, et al., 1997
Reverchon, E.; Porta, G.D.; Gorgoglione, D., Supercritical CO2 extraction of volatile oil from rose concrete, Flavour Fragr. J., 1997, 12, 1, 37-41, https://doi.org/10.1002/(SICI)1099-1026(199701)12:1<37::AID-FFJ605>3.0.CO;2-V . [all data]

King and Knight, 1992
King, J.R.; Knight, R.J., Volatile components of the leaves of various avocado cultivars, J. Agric. Food Chem., 1992, 40, 7, 1182-1185, https://doi.org/10.1021/jf00019a020 . [all data]