Cu11

Gas phase ion energetics data

Data compiled by: John E. Bartmess

Electron affinity determinations

EA (eV) Method Reference Comment
2.25 ± 0.15LPESTaylor, Pettiettehall, et al., 1992EA set as 0.2 eV above onset to correct for unresolved hot bands.
2.380 ± 0.060LPESZheng, Karner, et al., 1986

References

Taylor, Pettiettehall, et al., 1992
Taylor, K.J.; Pettiettehall, C.L.; Cheshnovsky, O.; Smalley, R.E., Ultraviolet Photoelectron Spectra of Coinage Metal Clusters, J. Chem. Phys., 1992, 96, 4, 3319, https://doi.org/10.1063/1.461927 . [all data]

Zheng, Karner, et al., 1986
Zheng, L.-S.; Karner, C.M.; Brucat, P.J.; Yang, S.H.; Pettiette, C.L.; Craycraft, M.J.; Smalley, R.E., Photodetachment studies of metal clusters: Electron affinity measurements for cux, J. Chem. Phys., 1986, 85, 1681. [all data]