Cyclohexanol, TMS derivative

Phase change data

Data compiled by: William E. Acree, Jr., James S. Chickos

Enthalpy of vaporization

ΔvapH (kJ/mol) Temperature (K) Method Reference Comment
45.1379.EBSheehan and Langer, 1969Based on data from 364. - 441. K.

References

Sheehan and Langer, 1969
Sheehan, Richard J.; Langer, Stanley H., Vapor pressures of fluorine- and silicon-containing derivatives of some hydroxylic compounds, J. Chem. Eng. Data, 1969, 14, 2, 248-250, https://doi.org/10.1021/je60041a011 . [all data]