Difluorohydroxyborane

Gas phase thermochemistry data

Quantity Value Units Method Reference Comment
Δfgas-1083.66kJ/molReviewChase, 1998Data last reviewed in March, 1965
Quantity Value Units Method Reference Comment
gas,1 bar269.17J/mol*KReviewChase, 1998Data last reviewed in March, 1965

Gas Phase Heat Capacity (Shomate Equation)

Cp° = A + B*t + C*t2 + D*t3 + E/t2
H° − H°298.15= A*t + B*t2/2 + C*t3/3 + D*t4/4 − E/t + F − H
S° = A*ln(t) + B*t + C*t2/2 + D*t3/3 − E/(2*t2) + G
    Cp = heat capacity (J/mol*K)
    H° = standard enthalpy (kJ/mol)
    S° = standard entropy (J/mol*K)
    t = temperature (K) / 1000.

View plot Requires a JavaScript / HTML 5 canvas capable browser.

View table.

Temperature (K) 298. - 1100.1100. - 6000.
A 6.12571195.71360
B 190.05236.445117
C -152.4152-1.242878
D 45.936970.083173
E 0.134063-11.56851
F -1092.225-1140.621
G 227.0418344.5143
H -1083.656-1083.656
ReferenceChase, 1998Chase, 1998
Comment Data last reviewed in March, 1965 Data last reviewed in March, 1965

Reaction thermochemistry data

Data compiled by: John E. Bartmess

Individual Reactions

BF2O- + Hydrogen cation = Difluorohydroxyborane

By formula: BF2O- + H+ = HBF2O

Quantity Value Units Method Reference Comment
Δr1579. ± 35.kJ/molAcidLarson and McMahon, 1987gas phase; These relative affinities are ca. 10 kcal/mol weaker than threshold values (see Wenthold and Squires, 1995) for donors greater than ca. 27 kcal/mol in free energy. This discrepancy has not yet been resolved, though the stronger value appears preferable.

Gas phase ion energetics data

Data compiled by: John E. Bartmess

De-protonation reactions

BF2O- + Hydrogen cation = Difluorohydroxyborane

By formula: BF2O- + H+ = HBF2O

Quantity Value Units Method Reference Comment
Δr1579. ± 35.kJ/molAcidLarson and McMahon, 1987gas phase; These relative affinities are ca. 10 kcal/mol weaker than threshold values (see Wenthold and Squires, 1995) for donors greater than ca. 27 kcal/mol in free energy. This discrepancy has not yet been resolved, though the stronger value appears preferable.

References

Chase, 1998
Chase, M.W., Jr., NIST-JANAF Themochemical Tables, Fourth Edition, J. Phys. Chem. Ref. Data, Monograph 9, 1998, 1-1951. [all data]

Larson and McMahon, 1987
Larson, J.W.; McMahon, T.B., Trends in Gas Phase Fluoride Ion Affinities of the Main Group Oxyfluorides and Fluoride Sulfides. Fluoride Adducts of FAsO, FPO, FPO2, F2SiO, F4SO, FBO, F2SiS, FPS, FAsS, F2S2, and S2O., Inorg. Chem., 1987, 26, 24, 4018, https://doi.org/10.1021/ic00271a011 . [all data]

Wenthold and Squires, 1995
Wenthold, P.G.; Squires, R.R., Bond dissociation energies of F2(-) and HF2(-). A gas-phase experimental and G2 theoretical study, J. Phys. Chem., 1995, 99, 7, 2002, https://doi.org/10.1021/j100007a034 . [all data]