(3aR,3bS,6S,6aR,6bS)-6-Isopropyl-3b-methyloctahydrocyclobuta[1,2:3,4]di[5]annulen-1(2H)-one

Van Den Dool and Kratz RI, non-polar column, temperature ramp

Data compiled by: NIST Mass Spectrometry Data Center, William E. Wallace, director

Column type Capillary
Active phase DB-5
Column length (m) 25.
Carrier gas He
Substrate
Column diameter (mm) 0.25
Phase thickness (μm)
Tstart (C) 70.
Tend (C) 275.
Heat rate (K/min) 4.
Initial hold (min)
Final hold (min)
I 1558.
ReferenceJavidnia, Miri, et al., 2002
Comment MSDC-RI

Normal alkane RI, polar column, custom temperature program

Data compiled by: NIST Mass Spectrometry Data Center, William E. Wallace, director

Column type CapillaryCapillaryCapillaryCapillaryCapillary
Active phase Innowax FSCHP-Innowax FSCHP-InnowaxHP-InnowaxInnowax FSC
Column length (m) 60.60.60.60.60.
Carrier gas HeHeHeHeHelium
Substrate
Column diameter (mm) 0.250.250.250.250.25
Phase thickness (μm) 0.250.250.250.250.25
Program 60C(10min) => 4C/min >220C (10min) => 1C/min => 240C60C(10min) => 4C/min => 220C(10min) => 1C/min => 240C60 0C (10 min) 4 K/min -> 220 0C (10 min) 1 K/min -> 240 0C60C(10min) => 4C/min => 220C(10min) => 1C/min => 240C60 0C (10 min) 4 0C/min -> 220 0C (10 min) 1 0C/min -> 240 0C
I 2046.2046.2046.2046.2045.
ReferenceBaser, Özek, et al., 2006Demirci, Dadandi, et al., 2003Baser, Demirci, et al., 2002Tabanca, Kirimer, et al., 2001Kirimer, Tabanca, et al., 1999
Comment MSDC-RI MSDC-RI MSDC-RI MSDC-RI MSDC-RI
Column type Capillary
Active phase Innowax
Column length (m) 60.
Carrier gas
Substrate
Column diameter (mm) 0.25
Phase thickness (μm) 0.25
Program 60C(10min) => 4C/min => 220C(10min) => 1C/min => 240C
I 2045.
ReferenceBaser, Kürkcüoglu, et al., 1998
Comment MSDC-RI

References

Javidnia, Miri, et al., 2002
Javidnia, K.; Miri, R.; Safavi, F.; Azarpira, A.; Shafiee, A., Composition of the essential oil of Nepeta persica Boiss from Iran, Flavour Fragr. J., 2002, 17, 1, 20-22, https://doi.org/10.1002/ffj.1023 . [all data]