VF2 radical

Gas phase ion energetics data

Data compiled by: John E. Bartmess

Electron affinity determinations

EA (eV) Method Reference Comment
0.40 ± 0.50EIAEFlesch and Svec, 1975From VOF3

References

Flesch and Svec, 1975
Flesch, G.D.; Svec, H.J., Thermochemistry of vanadium oxytrichloride and vanadium oxytrifluoride by mass spectrometry, Inorg. Chem., 1975, 14, 1817. [all data]