BeF3Na

Reaction thermochemistry data

Data compiled by: John E. Bartmess

Individual Reactions

AlF4- + BeF3Na = (AlF4- • BeF3Na)

By formula: AlF4- + BeF3Na = (AlF4- • BeF3Na)

Quantity Value Units Method Reference Comment
Δr45.9 ± 2.0kcal/molTDAsNikitin, Sorokin, et al., 1980gas phase; value altered from reference due to conversion from electron convention to ion convention

References

Nikitin, Sorokin, et al., 1980
Nikitin, M.I.; Sorokin, I.D.; Skokan, E.V.; Sidorov, L.N., Negative Ions in the Saturated Vapors of the Potassium Fluoride - Hafnium Tetrafluoride and Potassium Fluoride - Beryllium Difluoride Systems, Russ. J. Phys. Chem., 1980, 54, page]. [all data]