Limonene oxide, cis-

Van Den Dool and Kratz RI, polar column, temperature ramp

Data compiled by: NIST Mass Spectrometry Data Center, William E. Wallace, director

Column type CapillaryCapillaryCapillaryCapillaryCapillary
Active phase DB-WaxDB-WaxSupelcowax-10MegawaxInnowax
Column length (m) 60.30.60.30.15.
Carrier gas N2HeHeHeHe
Substrate
Column diameter (mm) 0.250.250.20.250.25
Phase thickness (μm) 0.250.250.20.250.25
Tstart (C) 70.40.60.40.35.
Tend (C) 230.250.200.220.225.
Heat rate (K/min) 2.3.2.2.4.
Initial hold (min) 2.  6.5.
Final hold (min) 20.20.10.10.20.
I 1458.1426.1408.1403.1458.
ReferenceChoi, 2005Gancel, Ollitrault, et al., 2005Smadja, Rondeau, et al., 2005Verzera, Trozzi, et al., 2005Chisholm, Jell, et al., 2003
Comment MSDC-RI MSDC-RI MSDC-RI MSDC-RI MSDC-RI
Column type CapillaryCapillaryCapillaryCapillaryCapillary
Active phase SupelcowaxDB-WaxDB-WaxMegawaxBP-20
Column length (m) 25.60.60.30.50.
Carrier gas  N2H2HeHe
Substrate
Column diameter (mm) 0.250.250.320.250.22
Phase thickness (μm) 0.250.250.250.250.25
Tstart (C) 35.70.40.40.60.
Tend (C) 225.230.245.220.220.
Heat rate (K/min) 4.2.1.52.2.
Initial hold (min) 5.2. 6.
Final hold (min) 10.20.20.10.20.
I 1467.1458.1426.1403.1440.
ReferenceChisholm, Wilson, et al., 2003Choi, 2003Gancel, Ollitrault, et al., 2003Verzera, Trozzi, et al., 2003Lota, de Rocca Serra, et al., 2002
Comment MSDC-RI MSDC-RI MSDC-RI MSDC-RI MSDC-RI
Column type CapillaryCapillaryCapillaryCapillaryCapillary
Active phase DB-WaxDB-WaxDB-WaxBP-20Megawax
Column length (m) 60.30.30.50.30.
Carrier gas N2HeHeHeHe
Substrate
Column diameter (mm) 0.250.250.250.220.25
Phase thickness (μm) 0.250.250.250.250.25
Tstart (C) 70.40.40.60.40.
Tend (C) 230.200.200.230.220.
Heat rate (K/min) 2.2.2.2.2.
Initial hold (min) 2.5.5. 6.
Final hold (min) 20.20.20.35.10.
I 1458.1433.1441.1440.1403.
ReferenceChoi and Sawamura, 2000Kim, Thuy, et al., 2000Kim, Thuy, et al., 2000Lota, de Rocca Serra, et al., 2000Verzera, Trozzi, et al., 2000
Comment MSDC-RI MSDC-RI MSDC-RI MSDC-RI MSDC-RI
Column type CapillaryCapillaryCapillaryCapillary
Active phase BP-20BP-20Carbowax 20MDB-Wax
Column length (m) 50.50.60.30.
Carrier gas HeHeHeHe
Substrate
Column diameter (mm) 0.220.220.320.32
Phase thickness (μm) 0.250.250.4250.5
Tstart (C) 60.60.45.40.
Tend (C) 230.230.300.220.
Heat rate (K/min) 2.2.3.3.
Initial hold (min)   3.
Final hold (min) 35.35.20.
I 1443.1443.1439.1444.
ReferenceLota, Serra, et al., 1999Lota, Serra, et al., 1999Mondello, Dugo, et al., 1995Le Quere and Latrasse, 1990
Comment MSDC-RI MSDC-RI MSDC-RI MSDC-RI

Kovats' RI, polar column, temperature ramp

Data compiled by: NIST Mass Spectrometry Data Center, William E. Wallace, director

Column type CapillaryCapillary
Active phase DB-WaxDB-Wax
Column length (m) 60.60.
Carrier gas
Substrate
Column diameter (mm) 0.250.25
Phase thickness (μm)
Tstart (C) 40.40.
Tend (C) 220.220.
Heat rate (K/min) 2.2.
Initial hold (min) 10.10.
Final hold (min)
I 1446.1449.
ReferenceUmano and Shibamoto, 1988Umano and Shibamoto, 1988
Comment MSDC-RI MSDC-RI

Normal alkane RI, non-polar column, custom temperature program

Data compiled by: NIST Mass Spectrometry Data Center, William E. Wallace, director

Column type CapillaryCapillaryCapillaryCapillaryCapillary
Active phase DB-1DB-1BPX-5SE-30OV-101
Column length (m) 60.30.30. 50.
Carrier gas HeliumHeliumHe N2
Substrate
Column diameter (mm) 0.250.250.25 0.25
Phase thickness (μm) 0.250.250.25
Program 50 0C (5 min) 3 0C/min -> 120 0C 5 0C/min -> 250 0C (3 min) 15 0C/min -> 300 0C (20 min)35 0C 4 0C/min -> 180 0C 10 0C/min -> 250 0C50C => 3C/min => 150C (10min) => 10C/min => 250Cnot specifiednot specified
I 1127.1144.1140.1115.1122.
ReferenceDelort and Jaquier, 2009Rao, Maia, et al., 2007Ozer H., Kilic H., et al., 2006Vinogradov, 2004Yang, 2001
Comment MSDC-RI MSDC-RI MSDC-RI MSDC-RI MSDC-RI
Column type Capillary
Active phase CP Sil 5 CB
Column length (m) 25.
Carrier gas N2
Substrate
Column diameter (mm)
Phase thickness (μm)
Program not specified
I 1126.
ReferenceWeyerstahl, Marschall, et al., 1997
Comment MSDC-RI

References

Choi, 2005
Choi, H.-S., Characteristic odor components of kumquat (Fortunella japonica Swingle) peel oil, J. Agric. Food Chem., 2005, 53, 5, 1642-1647, https://doi.org/10.1021/jf040324x . [all data]

Gancel, Ollitrault, et al., 2005
Gancel, A.-L.; Ollitrault, P.; Froelicher, Y.; Tomi, F.; Jacquemond, C.; Luro, F.; Brillouet, J.-M., Leaf volatile compounds of six citrus somatic allotetraploid hybrids originating from various combinations of lime, lemon, citron, sweet orange, and grapefruit, J. Agric. Food Chem., 2005, 53, 6, 2224-2230, https://doi.org/10.1021/jf048315b . [all data]

Smadja, Rondeau, et al., 2005
Smadja, J.; Rondeau, P.; Sing, A.S.C., Volatile constituents of five Citrus Petitgrain essential oils from Reunion, Flavour Fragr. J., 2005, 20, 4, 399-402, https://doi.org/10.1002/ffj.1438 . [all data]

Verzera, Trozzi, et al., 2005
Verzera, A.; Trozzi, A.; Zappala, M.; Condurso, C.; Cotroneo, A., Essential Oil Composition of Citrus meyerii Y. Tan. and Citrus medica L. cv. Diamante and Their Lemon Hybrids, J. Agric. Food Chem., 2005, 53, 12, 4890-4894, https://doi.org/10.1021/jf047879c . [all data]

Chisholm, Jell, et al., 2003
Chisholm, M.G.; Jell, J.A.; Cass, D.M., Jr., Characterization of the major odorants found in the peel oil of Citrus reticulata Blanco cv. Clementine using gas chromatography-olfactometry, Flavour Fragr. J., 2003, 18, 4, 275-281, https://doi.org/10.1002/ffj.1188 . [all data]

Chisholm, Wilson, et al., 2003
Chisholm, M.G.; Wilson, M.A.; Gaskey, G.M., Characterization of aroma volatiles in key lime essential oils (Cirtrus aurantifolia Swingle), Flavour Fragr. J., 2003, 18, 2, 106-115, https://doi.org/10.1002/ffj.1172 . [all data]

Choi, 2003
Choi, H.-S., Character impact odorants of Citrus Hallabong [(C. unshiu Marcov × C. sinensis Osbeck) × C. reticulata Blanco] cold-pressed peel oil, J. Agric. Food Chem., 2003, 51, 9, 2687-2692, https://doi.org/10.1021/jf021069o . [all data]

Gancel, Ollitrault, et al., 2003
Gancel, A.-L.; Ollitrault, P.; Froelicher, Y.; Tomi, F.; Jacquemond, C.; Luro, F.; Brillouet, J.-M., Leaf volatile compounds of seven citrus somatic tetraploid hybrids sharing willow leaf mandarin (Citrus deliciosa Ten.) as their common parent, J. Agric. Food Chem., 2003, 51, 20, 6006-6013, https://doi.org/10.1021/jf0345090 . [all data]

Verzera, Trozzi, et al., 2003
Verzera, A.; Trozzi, A.; Gazea, F.; Cicciarelloi, G.; Cotroneo, A., Effects of rootstock on the composition of bergamot (Citrus bergamia Risso et Poiteau) essential oil, J. Agric. Food Chem., 2003, 51, 1, 206-210, https://doi.org/10.1021/jf0206872 . [all data]

Lota, de Rocca Serra, et al., 2002
Lota, M.-L.; de Rocca Serra, D.; Tomi, F.; Jacquemond, C.; Casanova, J., Volatile components of peel and leaf oils of lemon and lime species, J. Agric. Food Chem., 2002, 50, 4, 796-805, https://doi.org/10.1021/jf010924l . [all data]

Choi and Sawamura, 2000
Choi, H.-S.; Sawamura, M., Composition of the essential oil of Citrus tamurana Hort. ex Tanaka (Hyuganatsu), J. Agric. Food Chem., 2000, 48, 10, 4868-4873, https://doi.org/10.1021/jf000651e . [all data]

Kim, Thuy, et al., 2000
Kim, T.H.; Thuy, N.T.; Shin, J.H.; Baek, H.H.; Lee, H.J., Aroma-active compounds of miniature beefsteakplant (Mosla dianthera Maxim.), J. Agric. Food Chem., 2000, 48, 7, 2877-2881, https://doi.org/10.1021/jf000219x . [all data]

Lota, de Rocca Serra, et al., 2000
Lota, M.-L.; de Rocca Serra, D.; Tomi, F.; Casanova, J., Chemical variability of peel and leaf essential oils of mandarins from Citrus reticulata Blanco, Biochem. Syst. Ecol., 2000, 28, 1, 61-78, https://doi.org/10.1016/S0305-1978(99)00036-8 . [all data]

Verzera, Trozzi, et al., 2000
Verzera, A.; Trozzi, A.; Cotroneo, A.; Lorenzo, D.; Dellacassa, E., Uruguayan essential oil. 12. Composition of Nova and Satsuma mandarin oils, J. Agric. Food Chem., 2000, 48, 7, 2903-2909, https://doi.org/10.1021/jf990734z . [all data]

Lota, Serra, et al., 1999
Lota, M.-L.; Serra, D.R.; Tomi, F.; Bessiere, J.-M.; Casanova, J., Chemical composition of peel and leaf essential oils of Citrus medica L. and C. limonimedica Lush., Flavour Fragr. J., 1999, 14, 3, 161-166, https://doi.org/10.1002/(SICI)1099-1026(199905/06)14:3<161::AID-FFJ801>3.0.CO;2-8 . [all data]

Mondello, Dugo, et al., 1995
Mondello, L.; Dugo, P.; Basile, A.; Dugo, G., Interactive use of linear retention indices, on polar and apolar columns, with a MS-library for reliable identification of complex mixtures, J. Microcolumn Sep., 1995, 7, 6, 581-591, https://doi.org/10.1002/mcs.1220070605 . [all data]

Le Quere and Latrasse, 1990
Le Quere, J.-L.; Latrasse, A., Composition of the Essential Oils of Blackcurrant Buds (Ribes nigrum L.), J. Agric. Food Chem., 1990, 38, 1, 3-10, https://doi.org/10.1021/jf00091a001 . [all data]