tert-butyldimethylantimony

Phase change data

Data compiled by: William E. Acree, Jr., James S. Chickos

Quantity Value Units Method Reference Comment
Δvap9.82 ± 0.002kcal/molN/AFulem, Moravek, et al., 2010Based on data from 288. - 308. K.

Enthalpy of sublimation

ΔsubH (kcal/mol) Temperature (K) Reference Comment
10.4 ± 0.002266.Fulem, Moravek, et al., 2010Based on data from 248. - 283. K.

References

Fulem, Moravek, et al., 2010
Fulem, Michal; Moravek, Pavel; Pangrac, Jiri; Hulicius, Eduard; Simecek, Tomislav; Ruzicka, Kvetoslav; Ruzicka, Vlastimil; Kozyrkin, Boris; Shatunov, Valery, Vapor Pressure of Trimethylantimony and tert -Butyldimethylantimony, J. Chem. Eng. Data, 2010, 55, 1, 362-365, https://doi.org/10.1021/je900372v . [all data]