Thionylimide

Gas phase ion energetics data

Data compiled as indicated in comments:
LLK - Sharon G. Lias, Rhoda D. Levin, and Sherif A. Kafafi

Ionization energy determinations

IE (eV) Method Reference Comment
11.3PESolouki, Rosmus, et al., 1976LLK
11.60PESolouki, Rosmus, et al., 1976Vertical value; LLK

References

Solouki, Rosmus, et al., 1976
Solouki, B.; Rosmus, P.; Bock, H., Photoelektronen-spektrum von HN=S=O, Angew. Chem., 1976, 88, 381. [all data]