Palladium tetrakis(phosphorus trifluoride)-

Gas phase ion energetics data

Data compiled by: Sharon G. Lias, Rhoda D. Levin, and Sherif A. Kafafi

Ionization energy determinations

IE (eV) Method Reference Comment
9.9 ± 0.1PEBassett, Higginson, et al., 1974Vertical value

References

Bassett, Higginson, et al., 1974
Bassett, P.J.; Higginson, B.R.; Lloyd, D.R.; Lynaugh, N.; Roberts, P.J., Helium-I photoelectron spectra of tetrakis(trifluoro- phosphine)-nickel(O), -palladium(O), and -platinum(O), J. Chem. Soc. Dalton Trans., 1974, 2316. [all data]