Beryllium bromide

Gas phase thermochemistry data

Quantity Value Units Method Reference Comment
Δfgas28.707kcal/molReviewChase, 1998Data last reviewed in June, 1975
Quantity Value Units Method Reference Comment
gas,1 bar54.613cal/mol*KReviewChase, 1998Data last reviewed in June, 1975

Gas Phase Heat Capacity (Shomate Equation)

Cp° = A + B*t + C*t2 + D*t3 + E/t2
H° − H°298.15= A*t + B*t2/2 + C*t3/3 + D*t4/4 − E/t + F − H
S° = A*ln(t) + B*t + C*t2/2 + D*t3/3 − E/(2*t2) + G
    Cp = heat capacity (cal/mol*K)
    H° = standard enthalpy (kcal/mol)
    S° = standard entropy (cal/mol*K)
    t = temperature (K) / 1000.

View plot Requires a JavaScript / HTML 5 canvas capable browser.

View table.

Temperature (K) 298. - 6000.
A 8.616791
B 0.427515
C -0.108939
D 0.012844
E -0.087248
F 25.82739
G 64.42720
H 28.70700
ReferenceChase, 1998
Comment Data last reviewed in June, 1975

References

Chase, 1998
Chase, M.W., Jr., NIST-JANAF Themochemical Tables, Fourth Edition, J. Phys. Chem. Ref. Data, Monograph 9, 1998, 1-1951. [all data]