Titanium difluoride

Gas phase thermochemistry data

Quantity Value Units Method Reference Comment
Δfgas-688.27kJ/molReviewChase, 1998Data last reviewed in December, 1968
Quantity Value Units Method Reference Comment
gas,1 bar255.69J/mol*KReviewChase, 1998Data last reviewed in December, 1968

Gas Phase Heat Capacity (Shomate Equation)

Cp° = A + B*t + C*t2 + D*t3 + E/t2
H° − H°298.15= A*t + B*t2/2 + C*t3/3 + D*t4/4 − E/t + F − H
S° = A*ln(t) + B*t + C*t2/2 + D*t3/3 − E/(2*t2) + G
    Cp = heat capacity (J/mol*K)
    H° = standard enthalpy (kJ/mol)
    S° = standard entropy (J/mol*K)
    t = temperature (K) / 1000.

View plot Requires a JavaScript / HTML 5 canvas capable browser.

View table.

Temperature (K) 298. - 1000.1000. - 6000.
A 52.1836848.29173
B 27.9868611.00342
C -29.28206-1.832622
D 10.927850.111994
E -0.4748843.880837
F -706.4266-696.1256
G 309.0281318.0786
H -688.2680-688.2680
ReferenceChase, 1998Chase, 1998
Comment Data last reviewed in December, 1968 Data last reviewed in December, 1968

Gas phase ion energetics data

Data compiled as indicated in comments:
RDSH - Henry M. Rosenstock, Keith Draxl, Bruce W. Steiner, and John T. Herron

Ionization energy determinations

IE (eV) Method Reference Comment
12.2 ± 0.5EIZmbov and Margrave, 1967RDSH

References

Chase, 1998
Chase, M.W., Jr., NIST-JANAF Themochemical Tables, Fourth Edition, J. Phys. Chem. Ref. Data, Monograph 9, 1998, 1-1951. [all data]

Zmbov and Margrave, 1967
Zmbov, K.F.; Margrave, J.L., Mass spectrometric studies at high temperatures. XVI.Sublimation pressures for TiF.and the stabilities of TiF2(g) and TiF(g), J. Phys. Chem., 1967, 71, 2893. [all data]