praseodymium triiodide

Phase change data

Data compiled by: William E. Acree, Jr., James S. Chickos

Quantity Value Units Method Reference Comment
Δsub280. ± 4.kJ/molN/AVillani, Brunetti, et al., 2000
Δsub275.kJ/molN/AVillani, Brunetti, et al., 2000

Enthalpy of sublimation

ΔsubH (kJ/mol) Temperature (K) Method Reference
263. ± 4.900.TEVillani, Brunetti, et al., 2000

References

Villani, Brunetti, et al., 2000
Villani, Anna Rita; Brunetti, Bruno; Piacente, Vincenzo, Vapor Pressures and Sublimation Enthalpies of Praseodymium Trichloride, Tribromide, and Triiodide, J. Chem. Eng. Data, 2000, 45, 6, 1167-1172, https://doi.org/10.1021/je0001532 . [all data]