Cyclopentenyl methyl ether

Phase change data

Data compiled by: William E. Acree, Jr., James S. Chickos

Quantity Value Units Method Reference Comment
Δvap10.1 ± 0.2kcal/molGSVerevkin and Welle, 1998Based on data from 274. - 313. K.

Enthalpy of vaporization

ΔvapH (kcal/mol) Temperature (K) Method Reference Comment
10.1 ± 0.2294.GSVerevkin and Welle, 1998Based on data from 274. - 313. K.

References

Verevkin and Welle, 1998
Verevkin, Sergey P.; Welle, Frank M., Structural Chemistry, 1998, 9, 3, 215-221, https://doi.org/10.1023/A:1022475115296 . [all data]