FSBr

Vibrational and/or electronic energy levels

Data compiled by: Marilyn E. Jacox

State:   X

Vib.
sym.
 No.   Approximate
 type of mode
 cm-1   Med.   Method   References

a' 1 SF stretch 765 Ar IR Della Vedova and Mack, 1993
3 SBr stretch 434 Ar IR Della Vedova and Mack, 1993

Additional references: Jacox, 1998, page 208

References

Della Vedova and Mack, 1993
Della Vedova, C.O.; Mack, H.-G., A matrix photochemistry study on (fluorocarbonyl)sulfenyl bromide: the precursor of sulfur bromide fluoride, Inorg. Chem., 1993, 32, 6, 948, https://doi.org/10.1021/ic00058a032 . [all data]

Jacox, 1998
Jacox, M.E., Vibrational and electronic energy levels of polyatomic transient molecules: supplement A, J. Phys. Chem. Ref. Data, 1998, 27, 2, 115-393, https://doi.org/10.1063/1.556017 . [all data]