Pentane-2,4-dione, 3-(4-methoxybenzoyl)-

Gas phase ion energetics data

Data compiled by: Sharon G. Lias and Joel F. Liebman

Ionization energy determinations

IE (eV) Method Reference
7.86EIOrlov, Rashkes, et al., 1988

References

Orlov, Rashkes, et al., 1988
Orlov, V.M.; Rashkes, Y.V.; Siretskaya, T.V.; Takhistov, V.V., Thermochemical description of tutomeric transformations in ionized 1,3-diketones, J. Gen. Chem. USSR, 1988, 58, 374. [all data]