hafnium tetrabromide

Gas phase ion energetics data

Data compiled by: Sharon G. Lias, Rhoda D. Levin, and Sherif A. Kafafi

Ionization energy determinations

IE (eV) Method Reference Comment
10.9PEEgdell and Orchard, 1978
11.06PEEgdell and Orchard, 1978Vertical value

Vibrational and/or electronic energy levels

Data compiled by: Takehiko Shimanouchi

Symmetry:   Td     Symmetry Number σ = 12

 Sym.   No   Approximate   Selected Freq.  Infrared   Raman   Comments
 Species   type of mode   Value   Rating   Value  Phase  Value  Phase

a1 1 Sym str 236  B  ia 235.5 gas
e 2 Deg deform 63  B  ia 63 gas
f2 3 Deg str 273  C 273 gas
f2 4 Deg deform 71  C 71 gas

Source: Shimanouchi, 1972

References

Egdell and Orchard, 1978
Egdell, R.G.; Orchard, A.F., Photoelectron spectra of the group IVA halides, J. Chem. Soc. Faraday Trans. 2, 1978, 74, 485. [all data]

Shimanouchi, 1972
Shimanouchi, T., Tables of Molecular Vibrational Frequencies Consolidated Volume II, J. Phys. Chem. Ref. Data, 1972, 6, 3, 993-1102. [all data]