Titanium monohydride

Reaction thermochemistry data

Data compiled by: John E. Bartmess

Individual Reactions

Ti- + Hydrogen cation = Titanium monohydride

By formula: Ti- + H+ = HTi

Quantity Value Units Method Reference Comment
Δr1508. ± 8.8kJ/molD-EAIlin, Sakharov, et al., 1987gas phase

References

Ilin, Sakharov, et al., 1987
Ilin, R.N.; Sakharov, V.I.; Serenkov, I.T., Study of Titanium Negative Ion Using Method of Electron Detachment by an Electric Field, Opt. Spectros. (USSR), 1987, 62, 578. [all data]