uranium pentafluoride

Gas phase ion energetics data

Data compiled as indicated in comments:
LLK - Sharon G. Lias, Rhoda D. Levin, and Sherif A. Kafafi

Ionization energy determinations

IE (eV) Method Reference Comment
11.3 ± 0.1EIHildenbrand, 1977LLK

References

Hildenbrand, 1977
Hildenbrand, D.L., Thermochemistry of gaseous UF5 and UF4, J. Chem. Phys., 1977, 66, 4788. [all data]