Xenon tetrafluoride oxide

Gas phase ion energetics data

Data compiled by: Sharon G. Lias, Rhoda D. Levin, and Sherif A. Kafafi

Ionization energy determinations

IE (eV) Method Reference
≥12.0PEBrundle and Jones, 1973

References

Brundle and Jones, 1973
Brundle, C.R.; Jones, G.R., The high resolution photoelectron spectra and the electronic structure of XeOF4, J. Electron Spectrosc. Relat. Phenom., 1973, 1, 403. [all data]