(Z)-2-((8R,8aS)-8,8a-Dimethyl-3,4,6,7,8,8a-hexahydronaphthalen-2(1H)-ylidene)propanal

Normal alkane RI, non-polar column, temperature ramp

View large format table.

Column type Active phase I Reference Comment
CapillaryHP-51812.Champagnat, Figueredo, et al., 200625. m/0.25 mm/0.25 μm, He, 50. C @ 5. min, 5. K/min; Tend: 300. C

References

Champagnat, Figueredo, et al., 2006
Champagnat, P.; Figueredo, G.; Chalchat, J.-C.; Bessiere, J.-M., Essential oil composition of Vetiveria nigritana from Mali, J. Essent. Oil Res., 2006, 18, 6, 647-649, https://doi.org/10.1080/10412905.2006.9699193 . [all data]