Silylgermane

Phase change data

Data compiled by: William E. Acree, Jr., James S. Chickos

Enthalpy of vaporization

ΔvapH (kJ/mol) Temperature (K) Reference Comment
25.0220.Spanier and MacDiarmid, 1963Based on data from 190. - 250. K.

References

Spanier and MacDiarmid, 1963
Spanier, Edward J.; MacDiarmid, Alan G., The Synthesis of Germylsilane from Silane and Germane in a Silent Electric Discharge, Inorg. Chem., 1963, 2, 1, 215-216, https://doi.org/10.1021/ic50005a055 . [all data]