Mercurous sulfate

Condensed phase thermochemistry data

Quantity Value Units Method Reference Comment
Δfsolid-743.09 ± 0.40kJ/molReviewCox, Wagman, et al., 1984CODATA Review value
Quantity Value Units Method Reference Comment
solid,1 bar200.70 ± 0.20J/mol*KReviewCox, Wagman, et al., 1984CODATA Review value

References

Cox, Wagman, et al., 1984
Cox, J.D.; Wagman, D.D.; Medvedev, V.A., CODATA Key Values for Thermodynamics, Hemisphere Publishing Corp., New York, 1984, 1. [all data]