potassium tetrahydroborate

Condensed phase thermochemistry data

Quantity Value Units Method Reference Comment
Δfsolid-54.230kcal/molReviewChase, 1998Data last reviewed in December, 1964
Quantity Value Units Method Reference Comment
solid25.480cal/mol*KReviewChase, 1998Data last reviewed in December, 1964

Solid Phase Heat Capacity (Shomate Equation)

Cp° = A + B*t + C*t2 + D*t3 + E/t2
H° − H°298.15= A*t + B*t2/2 + C*t3/3 + D*t4/4 − E/t + F − H
S° = A*ln(t) + B*t + C*t2/2 + D*t3/3 − E/(2*t2) + G
    Cp = heat capacity (cal/mol*K)
    H° = standard enthalpy (kcal/mol)
    S° = standard entropy (cal/mol*K)
    t = temperature (K) / 1000.

View plot Requires a JavaScript / HTML 5 canvas capable browser.

View table.

Temperature (K) 298. - 700.700. - 2000.
A 42.2704132.48251
B -43.66950-2.484090
C 6.6187701.201941
D 40.86840-0.150739
E -0.697182-1.837141
F -67.36931-69.15559
G 85.0772057.60980
H -54.23000-54.23000
ReferenceChase, 1998Chase, 1998
Comment Data last reviewed in December, 1964 Data last reviewed in December, 1964

References

Chase, 1998
Chase, M.W., Jr., NIST-JANAF Themochemical Tables, Fourth Edition, J. Phys. Chem. Ref. Data, Monograph 9, 1998, 1-1951. [all data]