VH2

Vibrational and/or electronic energy levels

Data compiled by: Marilyn E. Jacox

State:   X

Vib.
sym.
 No.   Approximate
 type of mode
 cm-1   Med.   Method   References

a1 1 VH s-stretch 1532.4 Ar IR Xiao, Hauge, et al., 1991
1 VH s-stretch 1545.2 m Kr IR Xiao, Hauge, et al., 1991
2 Bend 529 Kr IR Xiao, Hauge, et al., 1991
b2 3 VH a-stretch 1508.3 Ar IR Xiao, Hauge, et al., 1991
3 VH a-stretch 1490.7 vs Kr IR Xiao, Hauge, et al., 1991

Additional references: Jacox, 1994, page 14

References

Xiao, Hauge, et al., 1991
Xiao, Z.L.; Hauge, R.H.; Margrave, J.L., Reactions of vanadium and titanium with molecular hydrogen in krypton and argon matrixes at 12 K, J. Phys. Chem., 1991, 95, 7, 2696, https://doi.org/10.1021/j100160a015 . [all data]

Jacox, 1994
Jacox, M.E., Vibrational and electronic energy levels of polyatomic transient molecules, American Chemical Society, Washington, DC, 1994, 464. [all data]