erbium trifluoride

Gas phase ion energetics data

Data compiled by: Henry M. Rosenstock, Keith Draxl, Bruce W. Steiner, and John T. Herron

Appearance energy determinations

Ion AE (eV) Other Products MethodReferenceComment
Er+27.5 ± 0.7?EIZmbov and Margrave, 1968
Er+26.5 ± 0.3?EIBesenbruch, Charlu, et al., 1967
ErF+20.0 ± 0.7?EIZmbov and Margrave, 1968
ErF+20.5 ± 0.3?EIBesenbruch, Charlu, et al., 1967
ErF2+14.0 ± 0.7FEIZmbov and Margrave, 1968
ErF2+13.8 ± 0.3FEIBesenbruch, Charlu, et al., 1967
ErF2+12.5 ± 0.5FEIZmbov and Margrave, 1966

References

Zmbov and Margrave, 1968
Zmbov, K.F.; Margrave, J.L., Mass spectrometric studies of scandium, yttrium, lanthanum, and rare-earth fluorides, Advan. Chem. Ser., 1968, 72, 267. [all data]

Besenbruch, Charlu, et al., 1967
Besenbruch, G.; Charlu, T.V.; Zmbov, K.F.; Margrave, J.L., Mass spectrometric studies at high temperatures. XVII. Sublimation and vapor pressures of Dy(III), HO(III) and Er(III) fluorides, J. Less-Common Metals, 1967, 12, 375. [all data]

Zmbov and Margrave, 1966
Zmbov, K.F.; Margrave, J.L., Mass spectrometric studies at high temperatures. XII.Stabilities of dysprosium, holmium, and erbium subfluorides, J. Phys. Chem., 1966, 70, 3379. [all data]