thulium trifluoride

Gas phase ion energetics data

Data compiled by: Henry M. Rosenstock, Keith Draxl, Bruce W. Steiner, and John T. Herron

Appearance energy determinations

Ion AE (eV) Other Products MethodReferenceComment
TmF+20.8 ± 0.7?EIZmbov and Margrave, 1968
TmF+20.0 ± 0.5?EIZmbov and Margrave, 1967
TmF2+13.5 ± 0.7FEIZmbov and Margrave, 1968
TmF2+13.0 ± 0.5FEIZmbov and Margrave, 1967
Tm+27.0 ± 0.7?EIZmbov and Margrave, 1968
Tm+26.5 ± 0.5?EIZmbov and Margrave, 1967

References

Zmbov and Margrave, 1968
Zmbov, K.F.; Margrave, J.L., Mass spectrometric studies of scandium, yttrium, lanthanum, and rare-earth fluorides, Advan. Chem. Ser., 1968, 72, 267. [all data]

Zmbov and Margrave, 1967
Zmbov, K.F.; Margrave, J.L., Mass spectrometric studies at high temperatures. XIX. Sublimation pressures and heats of sublimation of TmF3, YbF3 and LuF3, J. Less-Common Metals, 1967, 12, 494. [all data]