silicon disulphide

Condensed phase thermochemistry data

Quantity Value Units Method Reference Comment
Δfliquid-49.455kcal/molReviewChase, 1998Data last reviewed in June, 1972
Quantity Value Units Method Reference Comment
liquid,1 bar20.25cal/mol*KReviewChase, 1998Data last reviewed in June, 1972
Quantity Value Units Method Reference Comment
Δfsolid-50.999kcal/molReviewChase, 1998Data last reviewed in June, 1972
Quantity Value Units Method Reference Comment
solid19.19cal/mol*KReviewChase, 1998Data last reviewed in June, 1972

Liquid Phase Heat Capacity (Shomate Equation)

Cp° = A + B*t + C*t2 + D*t3 + E/t2
H° − H°298.15= A*t + B*t2/2 + C*t3/3 + D*t4/4 − E/t + F − H
S° = A*ln(t) + B*t + C*t2/2 + D*t3/3 − E/(2*t2) + G
    Cp = heat capacity (cal/mol*K)
    H° = standard enthalpy (kcal/mol)
    S° = standard entropy (cal/mol*K)
    t = temperature (K) / 1000.

View plot Requires a JavaScript / HTML 5 canvas capable browser.

View table.

Temperature (K) 1363. - 2000.
A 21.75000
B 0.000000
C 0.000000
D 0.000000
E 0.000000
F -57.37770
G 43.75911
H -49.45610
ReferenceChase, 1998
Comment Data last reviewed in June, 1972

Solid Phase Heat Capacity (Shomate Equation)

Cp° = A + B*t + C*t2 + D*t3 + E/t2
H° − H°298.15= A*t + B*t2/2 + C*t3/3 + D*t4/4 − E/t + F − H
S° = A*ln(t) + B*t + C*t2/2 + D*t3/3 − E/(2*t2) + G
    Cp = heat capacity (cal/mol*K)
    H° = standard enthalpy (kcal/mol)
    S° = standard entropy (cal/mol*K)
    t = temperature (K) / 1000.

View plot Requires a JavaScript / HTML 5 canvas capable browser.

View table.

Temperature (K) 298. - 1363.
A 18.07410
B 2.055891
C 0.385965
D -0.078254
E -0.018567
F -56.54799
G 40.33169
H -51.00010
ReferenceChase, 1998
Comment Data last reviewed in June, 1972

Vibrational and/or electronic energy levels

Data compiled by: Marilyn E. Jacox

State:   X

Vib.
sym.
 No.   Approximate
 type of mode
 cm-1   Med.   Method   References

Σg+ 1 Sym. stretch 514 CH4 Ra Friesen and Schnockel, 1999
Σu+ 3 Asym. stretch 918.0 Ar IR Schnockel and Koppe, 1989

Additional references: Jacox, 1994, page 86; Jacox, 2003, page 131

References

Chase, 1998
Chase, M.W., Jr., NIST-JANAF Themochemical Tables, Fourth Edition, J. Phys. Chem. Ref. Data, Monograph 9, 1998, 1-1951. [all data]

Friesen and Schnockel, 1999
Friesen, M.; Schnockel, H., Ramanspektrum und Bindungsdiskussion von matrixisoliertem, molekularem Siliciumdisulfid, Z. Anorg. Allg. Chem., 1999, 625, 7, 1097, https://doi.org/10.1002/(SICI)1521-3749(199907)625:7<1097::AID-ZAAC1097>3.0.CO;2-3 . [all data]

Schnockel and Koppe, 1989
Schnockel, H.; Koppe, R., Matrix IR spectrum and ab initio SCF calculations of molecular silicon disulfide, J. Am. Chem. Soc., 1989, 111, 13, 4583, https://doi.org/10.1021/ja00195a009 . [all data]

Jacox, 1994
Jacox, M.E., Vibrational and electronic energy levels of polyatomic transient molecules, American Chemical Society, Washington, DC, 1994, 464. [all data]

Jacox, 2003
Jacox, M.E., Vibrational and electronic energy levels of polyatomic transient molecules: supplement B, J. Phys. Chem. Ref. Data, 2003, 32, 1, 1-441, https://doi.org/10.1063/1.1497629 . [all data]